Target
Receptor-type tyrosine-protein phosphatase F
Ligand
BDBM14230
Substrate
Meas. Tech.
ChEMBL_590756 (CHEMBL1050898)
Ki
1100000±n/a nM
Citation
 Vidovic, DSchürer, SC Knowledge-based characterization of similarity relationships in the human protein-tyrosine phosphatase family for rational inhibitor design. J Med Chem 52:6649-59 (2009)  
Target
Name:
Receptor-type tyrosine-protein phosphatase F
Synonyms:
LAR Leukocyte common antigen related (LAR) PTPRF_HUMAN Receptor-type tyrosine-protein phosphatase F (LAR)
Type:
Protein
Mol. Mass.:
212869.85
Organism:
Homo sapiens (Human)
Description:
P10586
Residue:
1907
  
Inhibitor
Name:
BDBM14230
Synonyms:
5-(carboxymethoxy)-3,7-dithiatricyclo[6.4.0.0^{2,6}]dodeca-1(8),2(6),4,9,11-pentaene-4-carboxylic acid | thienobenzothiophene 20
Type:
Small organic molecule
Emp. Form.:
C13H8O5S2
Mol. Mass.:
308.33
SMILES:
OC(=O)COc1c(sc2c1sc1ccccc21)C(O)=O
: