Target
Receptor-type tyrosine-protein phosphatase F
Ligand
BDBM50219573
Substrate
Meas. Tech.
ChEMBL_590756 (CHEMBL1050898)
Ki
>1000000±n/a nM
Citation
 Vidovic, DSchürer, SC Knowledge-based characterization of similarity relationships in the human protein-tyrosine phosphatase family for rational inhibitor design. J Med Chem 52:6649-59 (2009)  
Target
Name:
Receptor-type tyrosine-protein phosphatase F
Synonyms:
LAR Leukocyte common antigen related (LAR) PTPRF_HUMAN Receptor-type tyrosine-protein phosphatase F (LAR)
Type:
Protein
Mol. Mass.:
212869.85
Organism:
Homo sapiens (Human)
Description:
P10586
Residue:
1907
  
Inhibitor
Name:
BDBM50219573
Synonyms:
4-BROMO-3-(CARBOXYMETHOXY)-5-{3-[(3,3,5,5-TETRAMETHYLCYCLOHEXYL)AMINO]PHENYL}THIOPHENE-2-CARBOXYLIC ACID 4-bromo-3-carboxymethoxy-5-[3-(3,3,5,5-tetramethylcyclohexylamino)phenyl]thiophene-2-carboxylic acid | CHEMBL243942
Type:
Small organic molecule
Emp. Form.:
C23H28BrNO5S
Mol. Mass.:
510.441
SMILES:
CC1(C)CC(CC(C)(C)C1)Nc1cccc(c1)-c1sc(C(O)=O)c(OCC(O)=O)c1Br
: