Target
LIM domain kinase 2
Ligand
BDBM50299590
Substrate
Meas. Tech.
ChEMBL_592392 (CHEMBL1036965)
IC50
1300±n/a nM
Citation
 Harrison, BAWhitlock, NAVoronkov, MVAlmstead, ZYGu, KJMabon, RGardyan, MHamman, BDAllen, JGopinathan, SMcKnight, BCrist, MZhang, YLiu, YCourtney, LFKey, BZhou, JPatel, NYates, PWLiu, QWilson, AGKimball, SDCrosson, CERice, DSRawlins, DB Novel class of LIM-kinase 2 inhibitors for the treatment of ocular hypertension and associated glaucoma. J Med Chem 52:6515-8 (2009)  
Target
Name:
LIM domain kinase 2
Synonyms:
LIMK2 | LIMK2_HUMAN
Type:
PROTEIN
Mol. Mass.:
72238.81
Organism:
Homo sapiens (Human)
Description:
ChEMBL_1514398
Residue:
638
  
Inhibitor
Name:
BDBM50299590
Synonyms:
1-(5-methyl-7H-pyrrolo[2,3-d]pyrimidin-4-yl)-N-p-tolylpiperidine-4-carboxamide | CHEMBL570339
Type:
Small organic molecule
Emp. Form.:
C20H23N5O
Mol. Mass.:
349.4295
SMILES:
Cc1c[nH]c2ncnc(N3CCC(CC3)C(=O)Nc3ccc(C)cc3)c12
: