Target
LIM domain kinase 2
Ligand
BDBM50299603
Substrate
Meas. Tech.
ChEMBL_592392 (CHEMBL1036965)
IC50
133±n/a nM
Citation
 Harrison, BAWhitlock, NAVoronkov, MVAlmstead, ZYGu, KJMabon, RGardyan, MHamman, BDAllen, JGopinathan, SMcKnight, BCrist, MZhang, YLiu, YCourtney, LFKey, BZhou, JPatel, NYates, PWLiu, QWilson, AGKimball, SDCrosson, CERice, DSRawlins, DB Novel class of LIM-kinase 2 inhibitors for the treatment of ocular hypertension and associated glaucoma. J Med Chem 52:6515-8 (2009)  
Target
Name:
LIM domain kinase 2
Synonyms:
LIMK2 | LIMK2_HUMAN
Type:
PROTEIN
Mol. Mass.:
72238.81
Organism:
Homo sapiens (Human)
Description:
ChEMBL_1514398
Residue:
638
  
Inhibitor
Name:
BDBM50299603
Synonyms:
CHEMBL570819 | cis-N-(3-bromophenyl)-2,6-dimethyl-4-(5-methyl-7H-pyrrolo[2,3-d]pyrimidin-4-yl)piperazine-1-carboxamide
Type:
Small organic molecule
Emp. Form.:
C20H23BrN6O
Mol. Mass.:
443.34
SMILES:
C[C@H]1CN(C[C@@H](C)N1C(=O)Nc1cccc(Br)c1)c1ncnc2[nH]cc(C)c12
: