Target
Beta-2 adrenergic receptor
Ligand
BDBM50299898
Substrate
Meas. Tech.
ChEMBL_590086 (CHEMBL1044765)
EC50
1.5±n/a nM
Citation
 Hoenke, CBouyssou, TTautermann, CSRudolf, KSchnapp, AKonetzki, I Use of 5-hydroxy-4H-benzo[1,4]oxazin-3-ones as beta2-adrenoceptor agonists. Bioorg Med Chem Lett 19:6640-4 (2009)  
Target
Name:
Beta-2 adrenergic receptor
Synonyms:
ADRB2 ADRB2_HUMAN Beta-2 adrenoceptor | Beta-2 adrenoreceptor
Type:
Mol. Mass.:
46461.69
Organism:
Homo sapiens (Human)
Description:
P07550
Residue:
413
  
Inhibitor
Name:
BDBM50299898
Synonyms:
5-hydroxy-8-(1-hydroxy-2-(1-(4-isopropylphenyl)-2-methylpropan-2-ylamino)ethyl)-2H-benzo[b][1,4]oxazin-3(4H)-one | CHEMBL576848
Type:
Small organic molecule
Emp. Form.:
C23H30N2O4
Mol. Mass.:
398.4953
SMILES:
CC(C)c1ccc(CC(C)(C)NCC(O)c2ccc(O)c3NC(=O)COc23)cc1
: