Target
Poly [ADP-ribose] polymerase 1
Ligand
BDBM27135
Substrate
Meas. Tech.
ChEMBL_593118 (CHEMBL1042276)
Ki
5±n/a nM
Citation
 Tong, YBouska, JJEllis, PAJohnson, EFLeverson, JLiu, XMarcotte, PAOlson, AMOsterling, DJPrzytulinska, MRodriguez, LEShi, YSoni, NStavropoulos, JThomas, SDonawho, CKFrost, DJLuo, YGiranda, VLPenning, TD Synthesis and evaluation of a new generation of orally efficacious benzimidazole-based poly(ADP-ribose) polymerase-1 (PARP-1) inhibitors as anticancer agents. J Med Chem 52:6803-13 (2009)  
Target
Name:
Poly [ADP-ribose] polymerase 1
Synonyms:
(ARTD1 or PARP1) 2.4.2.30 ADPRT ARTD1 Human diphtheria toxin-like ADP-ribosyltransferase (ARTD1 or PARP1) NT-PARP-1 PARP1 PPOL Poly [ADP-ribose] polymerase 1 (PARP) Poly [ADP-ribose] polymerase 1 (PARP1) Poly [ADP-ribose] polymerase 1, 28-kDa form Poly [ADP-ribose] polymerase 1, processed C-terminus Poly [ADP-ribose] polymerase-1 Poly(ADP-ribose) polymerase-1 (ARTD1/PARP1) Protein poly-ADP-ribosyltransferase PARP1 | Synonyms=ADPRT
Type:
Mol. Mass.:
113114.22
Organism:
Homo sapiens (Human)
Description:
P09874
Residue:
1014
  
Inhibitor
Name:
BDBM27135
Synonyms:
2-[(2R)-2-methylpyrrolidin-2-yl]-1H-1,3-benzodiazole-4-carboxamide benzimidazole carboxamide, 3a
Type:
Small organic molecule
Emp. Form.:
C13H16N4O
Mol. Mass.:
244.2923
SMILES:
C[C@@]1(CCCN1)c1nc2cccc(C(N)=O)c2[nH]1
: