Target
Aurora kinase B
Ligand
BDBM50300027
Substrate
Meas. Tech.
ChEMBL_593164 (CHEMBL1044078)
IC50
>10000±n/a nM
Citation
 Cha, MYLee, KOKim, JWLee, CGSong, JYKim, YHLee, GSPark, SBKim, MS Discovery of a novel Her-1/Her-2 dual tyrosine kinase inhibitor for the treatment of Her-1 selective inhibitor-resistant non-small cell lung cancer. J Med Chem 52:6880-8 (2009)  
Target
Name:
Aurora kinase B
Synonyms:
AIK2 AIM1 ARK2 AURKB_HUMAN Aurora B-INCENP Aurora kinase B (AURKB) STK-1 STK12 Serine/threonine-protein kinase aurora B
Type:
Protein
Mol. Mass.:
39327.72
Organism:
Homo sapiens (Human)
Description:
Q96GD4
Residue:
344
  
Inhibitor
Name:
BDBM50300027
Synonyms:
(S)-1-Acryloyl-N-[4-(3-chloro-2,4-difluorophenylamino)-7-(2-methoxyethoxy)quinazolin-6-yl]pyrrolidine-2-carboxamide | CHEMBL569880
Type:
Small organic molecule
Emp. Form.:
C25H24ClF2N5O4
Mol. Mass.:
531.939
SMILES:
COCCOc1cc2ncnc(Nc3ccc(F)c(Cl)c3F)c2cc1NC(=O)[C@@H]1CCCN1C(=O)C=C
: