Target
Tyrosine-protein kinase Lck
Ligand
BDBM50300027
Substrate
Meas. Tech.
ChEMBL_593160 (CHEMBL1044074)
IC50
<100.0±n/a nM
Citation
 Cha, MYLee, KOKim, JWLee, CGSong, JYKim, YHLee, GSPark, SBKim, MS Discovery of a novel Her-1/Her-2 dual tyrosine kinase inhibitor for the treatment of Her-1 selective inhibitor-resistant non-small cell lung cancer. J Med Chem 52:6880-8 (2009)  
Target
Name:
Tyrosine-protein kinase Lck
Synonyms:
2.7.10.2 LCK_HUMAN Leukocyte C-terminal Src kinase Lymphocyte-specific protein tyrosine kinase Protein YT16 Proto-oncogene tyrosine-protein kinase LCK T cell-specific protein-tyrosine kinase
Type:
Mol. Mass.:
57987.83
Organism:
Homo sapiens (Human)
Description:
P06239
Residue:
509
  
Inhibitor
Name:
BDBM50300027
Synonyms:
(S)-1-Acryloyl-N-[4-(3-chloro-2,4-difluorophenylamino)-7-(2-methoxyethoxy)quinazolin-6-yl]pyrrolidine-2-carboxamide | CHEMBL569880
Type:
Small organic molecule
Emp. Form.:
C25H24ClF2N5O4
Mol. Mass.:
531.939
SMILES:
COCCOc1cc2ncnc(Nc3ccc(F)c(Cl)c3F)c2cc1NC(=O)[C@@H]1CCCN1C(=O)C=C
: