Target
Receptor tyrosine-protein kinase erbB-2
Ligand
BDBM50300027
Substrate
Meas. Tech.
ChEMBL_593142 (CHEMBL1044056)
IC50
18±n/a nM
Citation
 Cha, MYLee, KOKim, JWLee, CGSong, JYKim, YHLee, GSPark, SBKim, MS Discovery of a novel Her-1/Her-2 dual tyrosine kinase inhibitor for the treatment of Her-1 selective inhibitor-resistant non-small cell lung cancer. J Med Chem 52:6880-8 (2009)  
Target
Name:
Receptor tyrosine-protein kinase erbB-2
Synonyms:
2.7.10.1 CD_antigen=CD340 ERBB2_HUMAN FASN/HER2 HER2 MLN19 NEU Proto-oncogene Neu Tyrosine kinase-type cell surface receptor HER2 | p185erbB2
Type:
Mol. Mass.:
137894.47
Organism:
Homo sapiens (Human)
Description:
P04626
Residue:
1255
  
Inhibitor
Name:
BDBM50300027
Synonyms:
(S)-1-Acryloyl-N-[4-(3-chloro-2,4-difluorophenylamino)-7-(2-methoxyethoxy)quinazolin-6-yl]pyrrolidine-2-carboxamide | CHEMBL569880
Type:
Small organic molecule
Emp. Form.:
C25H24ClF2N5O4
Mol. Mass.:
531.939
SMILES:
COCCOc1cc2ncnc(Nc3ccc(F)c(Cl)c3F)c2cc1NC(=O)[C@@H]1CCCN1C(=O)C=C
: