Target
Serine/threonine-protein kinase mTOR
Ligand
BDBM50300069
Substrate
Meas. Tech.
ChEMBL_593489 (CHEMBL1047613)
IC50
0.23±n/a nM
Citation
 Zask, AKaplan, JVerheijen, JCRichard, DJCurran, KBrooijmans, NBennett, EMToral-Barza, LHollander, IAyral-Kaloustian, SYu, K Morpholine derivatives greatly enhance the selectivity of mammalian target of rapamycin (mTOR) inhibitors. J Med Chem 52:7942-5 (2009)  
Target
Name:
Serine/threonine-protein kinase mTOR
Synonyms:
FK506-binding protein 12-rapamycin complex-associated protein 1 FRAP FRAP1 MTOR Mammalian Target of Rapamycin (mTOR) RAFT1 Rapamycin and FKBP12 target 1 Serine/threonine-protein kinase (mTOR) | mTORC2
Type:
Rapamycin target protein
Mol. Mass.:
288917.12
Organism:
Homo sapiens (Human)
Description:
P42345
Residue:
2549
  
Inhibitor
Name:
BDBM50300069
Synonyms:
1-(4-(4-(8-oxa-3-azabicyclo[3.2.1]octan-3-yl)-1-(2,2,2-trifluoroethyl)-1H-pyrazolo[3,4-d]pyrimidin-6-yl)phenyl)-3-(2-fluoroethyl)urea | CHEMBL574905
Type:
Small organic molecule
Emp. Form.:
C22H23F4N7O2
Mol. Mass.:
493.4573
SMILES:
FCCNC(=O)Nc1ccc(cc1)-c1nc(N2CC3CCC(C2)O3)c2cnn(CC(F)(F)F)c2n1
: