Target
E3 ubiquitin-protein ligase Mdm2
Ligand
BDBM50300119
Substrate
Meas. Tech.
ChEMBL_593610 (CHEMBL1039715)
Ki
12.6±n/a nM
Citation
 Yu, SQin, DShangary, SChen, JWang, GDing, KMcEachern, DQiu, SNikolovska-Coleska, ZMiller, RKang, SYang, DWang, S Potent and orally active small-molecule inhibitors of the MDM2-p53 interaction. J Med Chem 52:7970-3 (2009)  
Target
Name:
E3 ubiquitin-protein ligase Mdm2
Synonyms:
Double minute 2 protein E3 ubiquitin-protein ligase Mdm2 (p53-binding protein Mdm2) Human Double Minute 2 (HDM2) MDM2-MDMX p53-Binding Protein MDM2 | p53-binding protein
Type:
Oncoprotein
Mol. Mass.:
55196.54
Organism:
Homo sapiens (Human)
Description:
Q00987
Residue:
491
  
Inhibitor
Name:
BDBM50300119
Synonyms:
(2'R,3S,4'R,5'R)-6-chloro-4'-(3-chlorophenyl)-N-((R)-3,4-dihydroxybutyl)-5-fluoro-2'-neopentyl-2-oxospiro[indoline-3,3'-pyrrolidine]-5'-carboxamide | CHEMBL576342
Type:
Small organic molecule
Emp. Form.:
C27H32Cl2FN3O4
Mol. Mass.:
552.465
SMILES:
CC(C)(C)C[C@H]1N[C@H]([C@H](c2cccc(Cl)c2)[C@@]11C(=O)Nc2cc(Cl)c(F)cc12)C(=O)NCC[C@@H](O)CO
: