Target
Cytochrome P450 3A4
Ligand
BDBM50300541
Substrate
Meas. Tech.
ChEMBL_588720 (CHEMBL1059329)
Ki
320±n/a nM
Citation
 McNulty, JNair, JJSingh, MCrankshaw, DJHolloway, AC Structure-activity studies on seco-pancratistatin analogs: potent inhibitors of human cytochrome P450 3A4. Bioorg Med Chem Lett 19:5607-12 (2009)  
Target
Name:
Cytochrome P450 3A4
Synonyms:
Albendazole monooxygenase CP3A4_HUMAN CYP3A4 CYPIIIA4 Cytochrome P450 3A4 (CYP3A4) Nifedipine oxidase Taurochenodeoxycholate 6-alpha-hydroxylase
Type:
Enzyme
Mol. Mass.:
57349.57
Organism:
Homo sapiens (Human)
Description:
Residue:
503
  
Inhibitor
Name:
BDBM50300541
Synonyms:
CHEMBL583953 | tert-butyl(2R,3R)-2-(benzo[d][1,3]dioxol-5-yl)-3-((4S,5S)-5-((tert-butyldimethylsilyloxy)methyl)-2,2-dimethyl-1,3-dioxolan-4-yl)-3-(methoxymethoxy)propylcarbamate
Type:
Small organic molecule
Emp. Form.:
C29H49NO9Si
Mol. Mass.:
583.7862
SMILES:
COCO[C@H]([C@@H](CNC(=O)OC(C)(C)C)c1ccc2OCOc2c1)[C@@H]1OC(C)(C)O[C@H]1CO[Si](C)(C)C(C)(C)C
: