Target
Glutathione reductase, mitochondrial
Ligand
BDBM50300754
Substrate
Meas. Tech.
ChEMBL_589949 (CHEMBL1050857)
IC50
>50000±n/a nM
Citation
 Rai, GSayed, AALea, WALuecke, HFChakrapani, HPrast-Nielsen, SJadhav, ALeister, WShen, MInglese, JAustin, CPKeefer, LArnér, ESSimeonov, AMaloney, DJWilliams, DLThomas, CJ Structure mechanism insights and the role of nitric oxide donation guide the development of oxadiazole-2-oxides as therapeutic agents against schistosomiasis. J Med Chem 52:6474-83 (2009)  
Target
Name:
Glutathione reductase, mitochondrial
Synonyms:
GLUR GSHR_HUMAN Glutathione reductase | Glutathione reductase (GR)
Type:
Enzyme
Mol. Mass.:
56271.52
Organism:
Homo sapiens (Human)
Description:
P00390
Residue:
522
  
Inhibitor
Name:
BDBM50300754
Synonyms:
2-Oxy-4-phenyl-furazan-3-carboxylic acid amide CHEMBL500868
Type:
Small organic molecule
Emp. Form.:
C9H7N3O3
Mol. Mass.:
205.1702
SMILES:
NC(=O)c1c(no[n+]1[O-])-c1ccccc1
: