Target
Adenosine receptor A2a
Ligand
BDBM50300877
Substrate
Meas. Tech.
ChEMBL_599660 (CHEMBL1042904)
Ki
945±n/a nM
Citation
 El-Tayeb, AIqbal, JBehrenswerth, ARomio, MSchneider, MZimmermann, HSchrader, JMüller, CE Nucleoside-5'-monophosphates as prodrugs of adenosine A2A receptor agonists activated by ecto-5'-nucleotidase. J Med Chem 52:7669-77 (2009)  
Target
Name:
Adenosine receptor A2a
Synonyms:
AA2AR_RAT Adenosine A2 receptor Adenosine Receptors A2a (A2a) Adenosine receptors A2a Rat striatal adenosine A2a receptor
Type:
G Protein-Coupled Receptor (GPCR)
Mol. Mass.:
45015.65
Organism:
Rattus norvegicus (rat)
Description:
Rat A2A receptors expressed in CHO cells.
Residue:
410
  
Inhibitor
Name:
BDBM50300877
Synonyms:
(2R,3R,4S,5R)-2-(6-amino-2-(cyclohexylmethylthio)-9H-purin-9-yl)-5-(hydroxymethyl)tetrahydrofuran-3,4-diol | CHEMBL568009
Type:
Small organic molecule
Emp. Form.:
C17H25N5O4S
Mol. Mass.:
395.477
SMILES:
Nc1nc(SCC2CCCCC2)nc2n(cnc12)[C@@H]1O[C@H](CO)[C@@H](O)[C@H]1O
: