Target
Histone-arginine methyltransferase CARM1
Ligand
BDBM50301071
Substrate
Meas. Tech.
ChEMBL_598368 (CHEMBL1037272)
IC50
>30±n/a nM
Citation
 Wan, HHuynh, TPang, SGeng, JVaccaro, WPoss, MATrainor, GLLorenzi, MVGottardis, MJayaraman, LPurandare, AV Benzo[d]imidazole inhibitors of Coactivator Associated Arginine Methyltransferase 1 (CARM1)--Hit to Lead studies. Bioorg Med Chem Lett 19:5063-6 (2009)  
Target
Name:
Histone-arginine methyltransferase CARM1
Synonyms:
CARM1 Coactivator-associated arginine methyltransferase 1 PRMT4 Protein arginine methyltransferase 4 (PRMT4)
Type:
Protein
Mol. Mass.:
65855.47
Organism:
Homo sapiens (Human)
Description:
Q86X55
Residue:
608
  
Inhibitor
Name:
BDBM50301071
Synonyms:
(S)-1-(4-(2-(2-methoxypyridin-3-yl)-4-methyl-1H-benzo[d]imidazol-6-yl)piperidin-1-yl)-N-methylpropan-2-amine | CHEMBL570550
Type:
Small organic molecule
Emp. Form.:
C23H31N5O
Mol. Mass.:
393.5251
SMILES:
CN[C@@H](C)CN1CCC(CC1)c1cc(C)c2nc([nH]c2c1)-c1cccnc1OC
: