Target
C-X-C chemokine receptor type 2
Ligand
BDBM50302100
Substrate
Meas. Tech.
ChEMBL_599856 (CHEMBL1043639)
IC50
3290±n/a nM
Citation
 Liu, SLiu, YWang, HDing, YWu, HDong, JWong, AChen, SHLi, GChan, MSawyer, NGervais, FGHenault, MKargman, SBedard, LLHan, YFriesen, RLobell, RBStout, DM Design, synthesis, and evaluation of novel 3-amino-4-hydrazine-cyclobut-3-ene-1,2-diones as potent and selective CXCR2 chemokine receptor antagonists. Bioorg Med Chem Lett 19:5741-5 (2009)  
Target
Name:
C-X-C chemokine receptor type 2
Synonyms:
C-X-C chemokine receptor type 2 (CXCR-2) CD_antigen=CD182 CXCR-2 CXCR2_HUMAN GRO/MGSA receptor IL-8 receptor type 2 IL8RB | Interleukin-8 receptor B
Type:
Protein
Mol. Mass.:
40767.88
Organism:
Homo sapiens (Human)
Description:
P25025
Residue:
360
  
Inhibitor
Name:
BDBM50302100
Synonyms:
3-(2-(2-acetyl-2-ethylhydrazinyl)-3,4-dioxocyclobut-1-enylamino)-2-hydroxy-N,N-dimethylbenzamide | CHEMBL576886
Type:
Small organic molecule
Emp. Form.:
C17H20N4O5
Mol. Mass.:
360.3645
SMILES:
CCN(Nc1c(Nc2cccc(C(=O)N(C)C)c2O)c(=O)c1=O)C(C)=O
: