Target
Cannabinoid receptor 1
Ligand
BDBM50303527
Substrate
Meas. Tech.
ChEMBL_596088 (CHEMBL1040876)
Ki
15±n/a nM
Citation
 Frost, JMDart, MJTietje, KRGarrison, TRGrayson, GKDaza, AVEl-Kouhen, OFYao, BBHsieh, GCPai, MZhu, CZChandran, PMeyer, MD Indol-3-ylcycloalkyl ketones: effects of N1 substituted indole side chain variations on CB(2) cannabinoid receptor activity. J Med Chem 53:295-315 (2010)  
Target
Name:
Cannabinoid receptor 1
Synonyms:
CANN6 CB-R CNR CNR1_HUMAN Cannabinoid receptor Cannabinoid receptor 1 (brain)
Type:
G Protein-Coupled Receptor (GPCR)
Mol. Mass.:
52868.96
Organism:
Homo sapiens (Human)
Description:
P21554
Residue:
472
  
Inhibitor
Name:
BDBM50303527
Synonyms:
(2,2,3,3-Tetramethylcyclopropyl)(1-(4,4,4-trifluorobutyl)-1Hindol-3-yl)methanone | CHEMBL569082
Type:
Small organic molecule
Emp. Form.:
C20H24F3NO
Mol. Mass.:
351.4059
SMILES:
CC1(C)C(C(=O)c2cn(CCCC(F)(F)F)c3ccccc23)C1(C)C
: