Target
Mitogen-activated protein kinase 14
Ligand
BDBM31828
Substrate
Meas. Tech.
ChEMBL_596266 (CHEMBL1050682)
IC50
800±n/a nM
Citation
 Klüter, SGrütter, CNaqvi, TRabiller, MSimard, JRPawar, VGetlik, MRauh, D Displacement assay for the detection of stabilizers of inactive kinase conformations. J Med Chem 53:357-67 (2010)  
Target
Name:
Mitogen-activated protein kinase 14
Synonyms:
CSAID-binding protein CSBP1 CSPB1 MAP kinase 14 MAP kinase p38 alpha MAPK14 MK14_HUMAN Mitogen-activated protein kinase p38 alpha Stress-activated protein kinase 2a | p38 MAP kinase alpha/beta
Type:
Serine/threonine-protein kinase
Mol. Mass.:
41286.76
Organism:
Homo sapiens (Human)
Description:
Q16539
Residue:
360
  
Inhibitor
Name:
BDBM31828
Synonyms:
quinazoline-pyrazolourea hybrid compound, 3b
Type:
Small organic molecule
Emp. Form.:
C29H30N8O
Mol. Mass.:
506.6015
SMILES:
Cc1cccc(c1)-n1nc(cc1NC(=O)Nc1ccc(Nc2ncnc3ccc(N)cc23)cc1)C(C)(C)C
: