Target
Mitogen-activated protein kinase 9
Ligand
BDBM31828
Substrate
Meas. Tech.
ChEMBL_596267 (CHEMBL1050683)
IC50
770±n/a nM
Citation
 Klüter, SGrütter, CNaqvi, TRabiller, MSimard, JRPawar, VGetlik, MRauh, D Displacement assay for the detection of stabilizers of inactive kinase conformations. J Med Chem 53:357-67 (2010)  
Target
Name:
Mitogen-activated protein kinase 9
Synonyms:
JNK-55 JNK2/JNK3 MK09_HUMAN Mitogen-activated protein kinase 8/9 SAPK1A c-Jun N-terminal kinase 2 | c-Jun N-terminal kinase 2 (JNK2)
Type:
Enzyme
Mol. Mass.:
48131.49
Organism:
Homo sapiens (Human)
Description:
JNK-2 was purchased from Upstate Cell Signaling Solutions (formerly Upstate Biotechnology).
Residue:
424
  
Inhibitor
Name:
BDBM31828
Synonyms:
quinazoline-pyrazolourea hybrid compound, 3b
Type:
Small organic molecule
Emp. Form.:
C29H30N8O
Mol. Mass.:
506.6015
SMILES:
Cc1cccc(c1)-n1nc(cc1NC(=O)Nc1ccc(Nc2ncnc3ccc(N)cc23)cc1)C(C)(C)C
: