Target
Delta-type opioid receptor
Ligand
BDBM50303627
Substrate
Meas. Tech.
ChEMBL_596275 (CHEMBL1050691)
Ki
960±n/a nM
Citation
 Decker, MSi, YGKnapp, BIBidlack, JMNeumeyer, JL Synthesis and opioid receptor binding affinities of 2-substituted and 3-aminomorphinans: ligands for mu, kappa, and delta opioid receptors. J Med Chem 53:402-18 (2010)  
Target
Name:
Delta-type opioid receptor
Synonyms:
D-OR-1 Delta opioid receptor OPIATE Delta OPRD1 OPRK1 | opioid receptor, delta 1
Type:
G Protein-Coupled Receptor (GPCR)
Mol. Mass.:
40382.98
Organism:
Homo sapiens (Human)
Description:
Competition binding assays were carried out using membrane preparations from transfected HN9.10 cells that constitutively expressed the delta opioid receptor.
Residue:
372
  
Inhibitor
Name:
BDBM50303627
Synonyms:
17-(Cyclobutylmethyl)-N,N-bis(4-iodobenzyl)morphinan-3-amine | CHEMBL568813
Type:
Small organic molecule
Emp. Form.:
C35H40I2N2
Mol. Mass.:
742.5144
SMILES:
Ic1ccc(CN(Cc2ccc(I)cc2)c2ccc3C[C@@H]4[C@@H]5CCCC[C@]5(CCN4CC4CCC4)c3c2)cc1
: