Target
Beta-secretase 2
Ligand
BDBM50303717
Substrate
Meas. Tech.
ChEMBL_597055 (CHEMBL1044550)
IC50
780±n/a nM
Citation
 Malamas, MSErdei, JGunawan, ITurner, JHu, YWagner, EFan, KChopra, ROlland, ABard, JJacobsen, SMagolda, RLPangalos, MRobichaud, AJ Design and synthesis of 5,5'-disubstituted aminohydantoins as potent and selective human beta-secretase (BACE1) inhibitors. J Med Chem 53:1146-58 (2010)  
Target
Name:
Beta-secretase 2
Synonyms:
AEPLC ASP1 Asp 1 Aspartyl protease 1 BACE2_HUMAN Beta-secretase (BACE) Beta-secretase 2 (BACE-2) Beta-site APP-cleaving enzyme 2 Memapsin-1 beta-Secretase (BACE-2)
Type:
Protein
Mol. Mass.:
56171.20
Organism:
Homo sapiens (Human)
Description:
Q9Y5Z0
Residue:
518
  
Inhibitor
Name:
BDBM50303717
Synonyms:
2-amino-4-(3-(2-fluoropyridin-3-yl)phenyl)-4-(4-methoxy-3-methylphenyl)-1-methyl-1H-imidazol-5(4H)-one rac-2-amino-4-(3-(2-fluoropyridin-3-yl)phenyl)-4-(4-methoxy-3-methylphenyl)-1-methyl-1H-imidazol-5(4H)-one
Type:
Small organic molecule
Emp. Form.:
C23H21FN4O2
Mol. Mass.:
404.4368
SMILES:
COc1ccc(cc1C)C1(N=C(N)N(C)C1=O)c1cccc(c1)-c1cccnc1F
: