Target
Glutamate receptor ionotropic, NMDA 2B
Ligand
BDBM50304086
Substrate
Meas. Tech.
ChEMBL_601749 (CHEMBL1047804)
Ki
817±n/a nM
Citation
 Mosley, CAMyers, SJMurray, EESantangelo, RTahirovic, YAKurtkaya, NMullasseril, PYuan, HLyuboslavsky, PLe, PWilson, LJYepes, MDingledine, RTraynelis, SFLiotta, DC Synthesis, structural activity-relationships, and biological evaluation of novel amide-based allosteric binding site antagonists in NR1A/NR2B N-methyl-D-aspartate receptors. Bioorg Med Chem 17:6463-80 (2009)  
Target
Name:
Glutamate receptor ionotropic, NMDA 2B
Synonyms:
GluN2B Grin2b NMDA receptor subunit N2B (GluN2B) NMDE2_RAT | NR2B
Type:
Protein
Mol. Mass.:
166077.66
Organism:
Rattus norvegicus (Rat)
Description:
Q00960
Residue:
1482
  
Inhibitor
Name:
BDBM50304086
Synonyms:
CHEMBL594417 | N-(4-(2-(4-(3,4-Dichlorophenyl)piperazin-1-yl)-2-oxoethoxy)phenyl)methanesulfonamide
Type:
Small organic molecule
Emp. Form.:
C19H21Cl2N3O4S
Mol. Mass.:
458.359
SMILES:
CS(=O)(=O)Nc1ccc(OCC(=O)N2CCN(CC2)c2ccc(Cl)c(Cl)c2)cc1
: