Target
Potassium voltage-gated channel subfamily H member 2
Ligand
BDBM50304091
Substrate
Meas. Tech.
ChEMBL_601840 (CHEMBL1045136)
Ki
3000±n/a nM
Citation
 Mosley, CAMyers, SJMurray, EESantangelo, RTahirovic, YAKurtkaya, NMullasseril, PYuan, HLyuboslavsky, PLe, PWilson, LJYepes, MDingledine, RTraynelis, SFLiotta, DC Synthesis, structural activity-relationships, and biological evaluation of novel amide-based allosteric binding site antagonists in NR1A/NR2B N-methyl-D-aspartate receptors. Bioorg Med Chem 17:6463-80 (2009)  
Target
Name:
Potassium voltage-gated channel subfamily H member 2
Synonyms:
1,3-beta-glucan synthase component GLS2 ERG Eag-related protein 1 Ether-a-go-go-related gene (HERG) Ether-a-go-go-related gene potassium channel 1 Ether-a-go-go-related gene potassium channel 1 (hERG1) Ether-a-go-go-related protein 1 H-ERG KCNH2 Potassium voltage-gated channel subfamily H member 2 (hERG) Voltage-gated potassium channel subunit Kv11.1 hERG Potassium Channel 1 | putative potassium channel subunit
Type:
Multi-pass membrane protein
Mol. Mass.:
126672.65
Organism:
Homo sapiens (Human)
Description:
Q12809
Residue:
1159
  
Inhibitor
Name:
BDBM50304091
Synonyms:
CHEMBL609857 | N-(3,4-Dichlorocinnamyl)-3-(4-(methylsulfonamido)-phenyl)propanamide
Type:
Small organic molecule
Emp. Form.:
C19H20Cl2N2O3S
Mol. Mass.:
427.345
SMILES:
CS(=O)(=O)Nc1ccc(CCC(=O)NC\C=C\c2ccc(Cl)c(Cl)c2)cc1
: