Target
5-hydroxytryptamine receptor 2C
Ligand
BDBM50304802
Substrate
Meas. Tech.
ChEMBL_606257 (CHEMBL1069947)
Ki
1.5±n/a nM
Citation
 Liu, KKCornelius, PPatterson, TAZeng, YSantucci, STomlinson, EGibbons, CMaurer, TSMarala, RBrown, JKong, JXLee, EWerner, WWenzel, ZVage, C Design and synthesis of orally-active and selective azaindane 5HT2c agonist for the treatment of obesity. Bioorg Med Chem Lett 20:266-71 (2010)  
Target
Name:
5-hydroxytryptamine receptor 2C
Synonyms:
5-HT-1C 5-HT1C 5-HT2C-INI 5-HTR2C 5-hydroxytryptamine receptor 2C (5-HT-2C) 5HT-1C HTR1C Serotonin (5-HT3) receptor Serotonin Receptor 2C
Type:
G Protein-Coupled Receptor (GPCR)
Mol. Mass.:
51836.79
Organism:
Homo sapiens (Human)
Description:
P28335
Residue:
458
  
Inhibitor
Name:
BDBM50304802
Synonyms:
(S)-8-(2-chlorophenoxy)-2-(piperazin-1-yl)-5,6,7,8-tetrahydroquinoline | CHEMBL595194
Type:
Small organic molecule
Emp. Form.:
C19H22ClN3O
Mol. Mass.:
343.85
SMILES:
Clc1ccccc1O[C@H]1CCCc2ccc(nc12)N1CCNCC1
: