Target
Acyl-CoA desaturase 1
Ligand
BDBM50304944
Substrate
Meas. Tech.
ChEMBL_606657 (CHEMBL1071884)
IC50
7±n/a nM
Citation
 Uto, YOgata, TKiyotsuka, YUeno, YMiyazawa, YKurata, HDeguchi, TWatanabe, NKonishi, MOkuyama, RKurikawa, NTakagi, TWakimoto, SOhsumi, J Novel benzoylpiperidine-based stearoyl-CoA desaturase-1 inhibitors: Identification of 6-[4-(2-methylbenzoyl)piperidin-1-yl]pyridazine-3-carboxylic acid (2-hydroxy-2-pyridin-3-ylethyl)amide and its plasma triglyceride-lowering effects in Zucker fatty rats. Bioorg Med Chem Lett 20:341-5 (2010)  
Target
Name:
Acyl-CoA desaturase 1
Synonyms:
ACOD1_MOUSE | Scd1
Type:
PROTEIN
Mol. Mass.:
41064.54
Organism:
Mus musculus
Description:
ChEMBL_1462109
Residue:
355
  
Inhibitor
Name:
BDBM50304944
Synonyms:
CHEMBL595474 | N-(2-hydroxy-2-phenylethyl)-6-(4-(2-methylbenzoyl)piperidin-1-yl)pyridazine-3-carboxamide
Type:
Small organic molecule
Emp. Form.:
C26H28N4O3
Mol. Mass.:
444.5255
SMILES:
Cc1ccccc1C(=O)C1CCN(CC1)c1ccc(nn1)C(=O)NCC(O)c1ccccc1
: