Target
Stearoyl-CoA desaturase
Ligand
BDBM50304947
Substrate
Meas. Tech.
ChEMBL_606659 (CHEMBL1071886)
IC50
292±n/a nM
Citation
 Uto, YOgata, TKiyotsuka, YUeno, YMiyazawa, YKurata, HDeguchi, TWatanabe, NKonishi, MOkuyama, RKurikawa, NTakagi, TWakimoto, SOhsumi, J Novel benzoylpiperidine-based stearoyl-CoA desaturase-1 inhibitors: Identification of 6-[4-(2-methylbenzoyl)piperidin-1-yl]pyridazine-3-carboxylic acid (2-hydroxy-2-pyridin-3-ylethyl)amide and its plasma triglyceride-lowering effects in Zucker fatty rats. Bioorg Med Chem Lett 20:341-5 (2010)  
Target
Name:
Stearoyl-CoA desaturase
Synonyms:
Acyl-CoA desaturase SCD SCDOS Stearoyl-CoA (SCD1) | Stearoyl-CoA desaturase 1
Type:
Enzyme
Mol. Mass.:
41537.27
Organism:
Homo sapiens (Human)
Description:
O00767
Residue:
359
  
Inhibitor
Name:
BDBM50304947
Synonyms:
6-(4-benzoylpiperidin-1-yl)-N-(2-hydroxy-2-phenylethyl)pyridazine-3-carboxamide | CHEMBL591100
Type:
Small organic molecule
Emp. Form.:
C25H26N4O3
Mol. Mass.:
430.4989
SMILES:
OC(CNC(=O)c1ccc(nn1)N1CCC(CC1)C(=O)c1ccccc1)c1ccccc1
: