Target
Muscarinic acetylcholine receptor M1
Ligand
BDBM50305822
Substrate
Meas. Tech.
ChEMBL_605044 (CHEMBL1071304)
EC50
>30000±n/a nM
Citation
 Bridges, TMKennedy, JPCho, HPBreininger, MLGentry, PRHopkins, CRConn, PJLindsley, CW Chemical lead optimization of a pan G(q) mAChR M(1), M(3), M(5) positive allosteric modulator (PAM) lead. Part I: Development of the first highly selective M(5) PAM. Bioorg Med Chem Lett 20:558-62 (2010)  
Target
Name:
Muscarinic acetylcholine receptor M1
Synonyms:
ACM1_RAT Chrm-1 cholinergic receptor, muscarinic 1
Type:
Enzyme Catalytic Domain
Mol. Mass.:
51390.46
Organism:
RAT
Description:
P08482
Residue:
460
  
Inhibitor
Name:
BDBM50305822
Synonyms:
1-(4-(1-methyl-1H-pyrazol-4-yl)benzyl)-5-(trifluoromethoxy)indoline-2,3-dione | CHEMBL596510
Type:
Small organic molecule
Emp. Form.:
C20H14F3N3O3
Mol. Mass.:
401.3387
SMILES:
Cn1cc(cn1)-c1ccc(CN2C(=O)C(=O)c3cc(OC(F)(F)F)ccc23)cc1
: