Target
Receptor tyrosine-protein kinase erbB-2
Ligand
BDBM50307769
Substrate
Meas. Tech.
ChEMBL_612310 (CHEMBL1064922)
IC50
11±n/a nM
Citation
 Cai, XZhai, HXWang, JForrester, JQu, HYin, LLai, CJBao, RQian, C Discovery of 7-(4-(3-ethynylphenylamino)-7-methoxyquinazolin-6-yloxy)-N-hydroxyheptanamide (CUDc-101) as a potent multi-acting HDAC, EGFR, and HER2 inhibitor for the treatment of cancer. J Med Chem 53:2000-9 (2010)  
Target
Name:
Receptor tyrosine-protein kinase erbB-2
Synonyms:
2.7.10.1 CD_antigen=CD340 ERBB2_HUMAN FASN/HER2 HER2 MLN19 NEU Proto-oncogene Neu Tyrosine kinase-type cell surface receptor HER2 | p185erbB2
Type:
Mol. Mass.:
137894.47
Organism:
Homo sapiens (Human)
Description:
P04626
Residue:
1255
  
Inhibitor
Name:
BDBM50307769
Synonyms:
3-(4-(3-chloro-4-fluorophenylamino)-7-methoxyquinazolin-6-yloxy)-N-hydroxypropanamide | CHEMBL597551
Type:
Small organic molecule
Emp. Form.:
C18H16ClFN4O4
Mol. Mass.:
406.795
SMILES:
COc1cc2ncnc(Nc3ccc(F)c(Cl)c3)c2cc1OCCC(=O)NO
: