Target
Receptor tyrosine-protein kinase erbB-2
Ligand
BDBM50307772
Substrate
Meas. Tech.
ChEMBL_612310 (CHEMBL1064922)
IC50
38±n/a nM
Citation
 Cai, XZhai, HXWang, JForrester, JQu, HYin, LLai, CJBao, RQian, C Discovery of 7-(4-(3-ethynylphenylamino)-7-methoxyquinazolin-6-yloxy)-N-hydroxyheptanamide (CUDc-101) as a potent multi-acting HDAC, EGFR, and HER2 inhibitor for the treatment of cancer. J Med Chem 53:2000-9 (2010)  
Target
Name:
Receptor tyrosine-protein kinase erbB-2
Synonyms:
2.7.10.1 CD_antigen=CD340 ERBB2_HUMAN FASN/HER2 HER2 MLN19 NEU Proto-oncogene Neu Tyrosine kinase-type cell surface receptor HER2 | p185erbB2
Type:
Mol. Mass.:
137894.47
Organism:
Homo sapiens (Human)
Description:
P04626
Residue:
1255
  
Inhibitor
Name:
BDBM50307772
Synonyms:
5-(4-(3-Ethynylphenylamino)-7-methoxyquinazolin-6-yloxy)-N-hydroxypentanamide | CHEMBL599398
Type:
Small organic molecule
Emp. Form.:
C22H22N4O4
Mol. Mass.:
406.4345
SMILES:
COc1cc2ncnc(Nc3cccc(c3)C#C)c2cc1OCCCCC(=O)NO
: