Target
Epidermal growth factor receptor
Ligand
BDBM50307934
Substrate
Meas. Tech.
ChEMBL_608087 (CHEMBL1072157)
IC50
8.43±n/a nM
Citation
 Carmi, CCavazzoni, AVezzosi, SBordi, FVacondio, FSilva, CRivara, SLodola, AAlfieri, RRLa Monica, SGaletti, MArdizzoni, APetronini, PGMor, M Novel irreversible epidermal growth factor receptor inhibitors by chemical modulation of the cysteine-trap portion. J Med Chem 53:2038-50 (2010)  
Target
Name:
Epidermal growth factor receptor
Synonyms:
EGF Receptor Substrate EGFR_HUMAN ERBB1 Epidermal Growth Factor Receptor erbB-1 Epidermal growth factor receptor (EGFR) HER1 Proto-oncogene c-ErbB-1 Tyrosine-Protein Kinase ErbB-1
Type:
Receptor Kinase Domain
Mol. Mass.:
134279.59
Organism:
Homo sapiens (Human)
Description:
P00533
Residue:
1210
  
Inhibitor
Name:
BDBM50307934
Synonyms:
CHEMBL597200 | N-(4-(3-Bromoanilino)quinazolin-6-yl)-2-(4-fluorophenoxy)-acetamide
Type:
Small organic molecule
Emp. Form.:
C22H16BrFN4O2
Mol. Mass.:
467.29
SMILES:
Fc1ccc(OCC(=O)Nc2ccc3ncnc(Nc4cccc(Br)c4)c3c2)cc1
: