Target
Epidermal growth factor receptor
Ligand
BDBM50307935
Substrate
Meas. Tech.
ChEMBL_608090 (CHEMBL1072160)
IC50
7±n/a nM
Citation
 Carmi, CCavazzoni, AVezzosi, SBordi, FVacondio, FSilva, CRivara, SLodola, AAlfieri, RRLa Monica, SGaletti, MArdizzoni, APetronini, PGMor, M Novel irreversible epidermal growth factor receptor inhibitors by chemical modulation of the cysteine-trap portion. J Med Chem 53:2038-50 (2010)  
Target
Name:
Epidermal growth factor receptor
Synonyms:
EGF Receptor Substrate EGFR_HUMAN ERBB1 Epidermal Growth Factor Receptor erbB-1 Epidermal growth factor receptor (EGFR) HER1 Proto-oncogene c-ErbB-1 Tyrosine-Protein Kinase ErbB-1
Type:
Receptor Kinase Domain
Mol. Mass.:
134279.59
Organism:
Homo sapiens (Human)
Description:
P00533
Residue:
1210
  
Inhibitor
Name:
BDBM50307935
Synonyms:
(2R,3S)-N-(4-(3-Bromoanilino)quinazolin-6-yl)-3-(piperidin-1-ylmethyl)oxirane-2-carboxamide | CHEMBL598007
Type:
Small organic molecule
Emp. Form.:
C23H24BrN5O2
Mol. Mass.:
482.373
SMILES:
Brc1cccc(Nc2ncnc3ccc(NC(=O)[C@@H]4O[C@H]4CN4CCCCC4)cc23)c1
: