Target
Cannabinoid receptor 2
Ligand
BDBM50308541
Substrate
Meas. Tech.
ChEMBL_613496 (CHEMBL1072262)
Ki
5.4±n/a nM
Citation
 Gao, MWang, MMiller, KDHutchins, GDZheng, QH Synthesis and in vitro biological evaluation of carbon-11-labeled quinoline derivatives as new candidate PET radioligands for cannabinoid CB2 receptor imaging. Bioorg Med Chem 18:2099-106 (2010)  
Target
Name:
Cannabinoid receptor 2
Synonyms:
CANNABINOID CB2 CB2 CB2B CNR2_HUMAN Cannabinoid CB2 receptor Cannabinoid receptor 2 (CB2R) | hCB2
Type:
G Protein-Coupled Receptor (GPCR)
Mol. Mass.:
39690.94
Organism:
Homo sapiens (Human)
Description:
P34972
Residue:
360
  
Inhibitor
Name:
BDBM50308541
Synonyms:
7-Methoxy-2-oxo-8-pentyloxy-1,2-dihydroquinoline-3-carboxylic acid[2-(4-fluorophenyl)ethyl]amide | CHEMBL600647
Type:
Small organic molecule
Emp. Form.:
C24H27FN2O4
Mol. Mass.:
426.4806
SMILES:
CCCCCOc1c(OC)ccc2cc(C(=O)NCCc3ccc(F)cc3)c(=O)[nH]c12
: