Target
Mitogen-activated protein kinase 14
Ligand
BDBM50308764
Substrate
Meas. Tech.
ChEMBL_607570 (CHEMBL1073514)
IC50
11±n/a nM
Citation
 Dietrich, JGokhale, VWang, XHurley, LHFlynn, GA Application of a novel [3+2] cycloaddition reaction to prepare substituted imidazoles and their use in the design of potent DFG-out allosteric B-Raf inhibitors. Bioorg Med Chem 18:292-304 (2010)  
Target
Name:
Mitogen-activated protein kinase 14
Synonyms:
CSAID-binding protein CSBP1 CSPB1 MAP kinase 14 MAP kinase p38 alpha MAPK14 MK14_HUMAN Mitogen-activated protein kinase p38 alpha Stress-activated protein kinase 2a | p38 MAP kinase alpha/beta
Type:
Serine/threonine-protein kinase
Mol. Mass.:
41286.76
Organism:
Homo sapiens (Human)
Description:
Q16539
Residue:
360
  
Inhibitor
Name:
BDBM50308764
Synonyms:
4-(3,4-Difluorophenyl)-N-(4-methyl-3-(3-methyl-4-oxo-3,4-dihydroquinazolin-6-ylamino)phenyl)-2-(trifluoromethyl)-1H-imidazole-5-carboxamide | CHEMBL591275
Type:
Small organic molecule
Emp. Form.:
C27H19F5N6O2
Mol. Mass.:
554.4708
SMILES:
Cc1ccc(NC(=O)c2[nH]c(nc2-c2ccc(F)c(F)c2)C(F)(F)F)cc1Nc1ccc2ncn(C)c(=O)c2c1
: