Target
Tyrosine-protein phosphatase non-receptor type 1
Ligand
BDBM50308843
Substrate
Meas. Tech.
ChEMBL_607676 (CHEMBL1071696)
Ki
4300±n/a nM
Citation
 Combs, AP Recent advances in the discovery of competitive protein tyrosine phosphatase 1B inhibitors for the treatment of diabetes, obesity, and cancer. J Med Chem 53:2333-44 (2010)  
Target
Name:
Tyrosine-protein phosphatase non-receptor type 1
Synonyms:
PTN1_HUMAN PTPN1 Protein tyrosine phosphatase-1B (PTP1B) Protein-tyrosine phosphatase 1B (PTP1B) Tyrosine-protein phosphatase non-receptor type 1 (PTP1B)
Type:
Protein phosphatase
Mol. Mass.:
49963.76
Organism:
Homo sapiens (Human)
Description:
Human recombinant GST-fusion PTP1B (1-435).
Residue:
435
  
Inhibitor
Name:
BDBM50308843
Synonyms:
5-{2-Methyl-5-[3-(1-phenylmethanesulfonyl-piperidin-4-ylamino)-phenyl]-thiophen-3-yl}-1,1-dioxo-1lambda*6*-isothiazolidin-3-one | CHEMBL592060
Type:
Small organic molecule
Emp. Form.:
C26H29N3O5S3
Mol. Mass.:
559.721
SMILES:
Cc1sc(cc1C1CC(=O)NS1(=O)=O)-c1cccc(NC2CCN(CC2)S(=O)(=O)Cc2ccccc2)c1
: