Target
Cytosolic phospholipase A2
Ligand
BDBM50308971
Substrate
Meas. Tech.
ChEMBL_611785 (CHEMBL1066442)
IC50
>10000±n/a nM
Citation
 Forster, LLudwig, JKaptur, MBovens, SElfringhoff, ASHoltfrerich, ALehr, M 1-Indol-1-yl-propan-2-ones and related heterocyclic compounds as dual inhibitors of cytosolic phospholipase A(2)alpha and fatty acid amide hydrolase. Bioorg Med Chem 18:945-52 (2010)  
Target
Name:
Cytosolic phospholipase A2
Synonyms:
CPLA2 PA24A_HUMAN PLA2G4A Phospholipase A2 | Phospholipase A2 group IVA
Type:
Protein
Mol. Mass.:
85219.30
Organism:
Homo sapiens (Human)
Description:
P47712
Residue:
749
  
Inhibitor
Name:
BDBM50308971
Synonyms:
1-Benzimidazol-1-yl-3-(4-octylphenoxy)propan-2-one | CHEMBL590143
Type:
Small organic molecule
Emp. Form.:
C24H30N2O2
Mol. Mass.:
378.5072
SMILES:
CCCCCCCCc1ccc(OCC(=O)Cn2cnc3ccccc23)cc1
: