Target
Fatty-acid amide hydrolase 1 [30-579]
Ligand
BDBM50110846
Substrate
Meas. Tech.
ChEMBL_611783 (CHEMBL1066440)
IC50
59±n/a nM
Citation
 Forster, LLudwig, JKaptur, MBovens, SElfringhoff, ASHoltfrerich, ALehr, M 1-Indol-1-yl-propan-2-ones and related heterocyclic compounds as dual inhibitors of cytosolic phospholipase A(2)alpha and fatty acid amide hydrolase. Bioorg Med Chem 18:945-52 (2010)  
Target
Name:
Fatty-acid amide hydrolase 1 [30-579]
Synonyms:
Anandamide amidohydrolase 1 Faah Fatty Acid Amide Hydrolase Fatty-acid amide hydrolase (FAAH) Fatty-acid amide hydrolase 1 (FAAH) Oleamide hydrolase 1
Type:
Single-pass membrane protein; homodimer
Mol. Mass.:
60474.00
Organism:
Rattus norvegicus (rat)
Description:
P97612 (aa 30-579)
Residue:
550
  
Inhibitor
Name:
BDBM50110846
Synonyms:
4-(3-(4-(decyloxy)phenoxy)-2-oxopropoxy)benzoic acid 4-[3-(4-Decyloxy-phenoxy)-2-oxo-propoxy]-benzoic acid(AR-C70484XX) | CHEMBL30108
Type:
Small organic molecule
Emp. Form.:
C26H34O6
Mol. Mass.:
442.5446
SMILES:
CCCCCCCCCCOc1ccc(OCC(=O)COc2ccc(cc2)C(O)=O)cc1
: