Target
Fatty-acid amide hydrolase 1 [30-579]
Ligand
BDBM50308973
Substrate
Meas. Tech.
ChEMBL_611783 (CHEMBL1066440)
IC50
110±n/a nM
Citation
 Forster, LLudwig, JKaptur, MBovens, SElfringhoff, ASHoltfrerich, ALehr, M 1-Indol-1-yl-propan-2-ones and related heterocyclic compounds as dual inhibitors of cytosolic phospholipase A(2)alpha and fatty acid amide hydrolase. Bioorg Med Chem 18:945-52 (2010)  
Target
Name:
Fatty-acid amide hydrolase 1 [30-579]
Synonyms:
Anandamide amidohydrolase 1 Faah Fatty Acid Amide Hydrolase Fatty-acid amide hydrolase (FAAH) Fatty-acid amide hydrolase 1 (FAAH) Oleamide hydrolase 1
Type:
Single-pass membrane protein; homodimer
Mol. Mass.:
60474.00
Organism:
Rattus norvegicus (rat)
Description:
P97612 (aa 30-579)
Residue:
550
  
Inhibitor
Name:
BDBM50308973
Synonyms:
1-[3-(4-Octylphenoxy)-2-oxopropyl]pyrazole-4-carboxylic ac | CHEMBL608435
Type:
Small organic molecule
Emp. Form.:
C21H28N2O4
Mol. Mass.:
372.458
SMILES:
CCCCCCCCc1ccc(OCC(=O)Cn2cc(cn2)C(O)=O)cc1
: