Target
Cytosolic phospholipase A2
Ligand
BDBM50185353
Substrate
Meas. Tech.
ChEMBL_611785 (CHEMBL1066442)
IC50
340±n/a nM
Citation
 Forster, LLudwig, JKaptur, MBovens, SElfringhoff, ASHoltfrerich, ALehr, M 1-Indol-1-yl-propan-2-ones and related heterocyclic compounds as dual inhibitors of cytosolic phospholipase A(2)alpha and fatty acid amide hydrolase. Bioorg Med Chem 18:945-52 (2010)  
Target
Name:
Cytosolic phospholipase A2
Synonyms:
CPLA2 PA24A_HUMAN PLA2G4A Phospholipase A2 | Phospholipase A2 group IVA
Type:
Protein
Mol. Mass.:
85219.30
Organism:
Homo sapiens (Human)
Description:
P47712
Residue:
749
  
Inhibitor
Name:
BDBM50185353
Synonyms:
3-tert-butyl-1-(3-(4-octylphenoxy)-2-oxopropyl)-1H-indole-5-carboxylic acid CHEMBL206943
Type:
Small organic molecule
Emp. Form.:
C30H39NO4
Mol. Mass.:
477.635
SMILES:
CCCCCCCCc1ccc(OCC(=O)Cn2cc(c3cc(ccc23)C(O)=O)C(C)(C)C)cc1
: