Target
Cytosolic phospholipase A2
Ligand
BDBM50308973
Substrate
Meas. Tech.
ChEMBL_611785 (CHEMBL1066442)
IC50
1800±n/a nM
Citation
 Forster, LLudwig, JKaptur, MBovens, SElfringhoff, ASHoltfrerich, ALehr, M 1-Indol-1-yl-propan-2-ones and related heterocyclic compounds as dual inhibitors of cytosolic phospholipase A(2)alpha and fatty acid amide hydrolase. Bioorg Med Chem 18:945-52 (2010)  
Target
Name:
Cytosolic phospholipase A2
Synonyms:
CPLA2 PA24A_HUMAN PLA2G4A Phospholipase A2 | Phospholipase A2 group IVA
Type:
Protein
Mol. Mass.:
85219.30
Organism:
Homo sapiens (Human)
Description:
P47712
Residue:
749
  
Inhibitor
Name:
BDBM50308973
Synonyms:
1-[3-(4-Octylphenoxy)-2-oxopropyl]pyrazole-4-carboxylic ac | CHEMBL608435
Type:
Small organic molecule
Emp. Form.:
C21H28N2O4
Mol. Mass.:
372.458
SMILES:
CCCCCCCCc1ccc(OCC(=O)Cn2cc(cn2)C(O)=O)cc1
: