Target
Sodium-dependent noradrenaline transporter
Ligand
BDBM50005247
Substrate
Meas. Tech.
ChEMBL_622530 (CHEMBL1116588)
IC50
266±n/a nM
Citation
 Cloonan, SMKeating, JJButler, SGKnox, AJJørgensen, AMPeters, GHRai, DCorrigan, DLloyd, DGWilliams, DCMeegan, MJ Synthesis and serotonin transporter activity of sulphur-substituted alpha-alkyl phenethylamines as a new class of anticancer agents. Eur J Med Chem 44:4862-88 (2009)  
Target
Name:
Sodium-dependent noradrenaline transporter
Synonyms:
Monoamine transporter NET Noradrenaline Transporter (NET) Norepinephrine transporter protein (NET) SLC6A2 Sodium-dependent noradrenaline transporter (NET) | Solute carrier family 6 member 2
Type:
Multi-pass membrane protein
Mol. Mass.:
69337.72
Organism:
Homo sapiens (Human)
Description:
P23975
Residue:
617
  
Inhibitor
Name:
BDBM50005247
Synonyms:
(+/-)2-Benzo[1,3]dioxol-5-yl-1-methyl-ethylamine (R)-(-)-2-Benzo[1,3]dioxol-5-yl-1-methyl-ethylamine 2-Benzo[1,3]dioxol-5-yl-1-methyl-ethylamine 3,4-methylenedioxyamphetamine MDA MDA,R(-) methylenedioxyamphetamine
Type:
Small organic molecule
Emp. Form.:
C10H13NO2
Mol. Mass.:
179.2157
SMILES:
CC(N)Cc1ccc2OCOc2c1
: