Target
Mu-type opioid receptor
Ligand
BDBM50311480
Substrate
Meas. Tech.
ChEMBL_622958 (CHEMBL1112210)
Ki
19±n/a nM
Citation
 Palin, RClark, JKEvans, LFeilden, HFletcher, DHamilton, NMHoughton, AKJones, PSMcArthur, DMontgomery, BRatcliffe, PDSmith, ARSutherland, AWeston, MAWishart, G Rapid access towards follow-up NOP receptor agonists using a knowledge based approach. Bioorg Med Chem Lett 19:6441-6 (2009)  
Target
Name:
Mu-type opioid receptor
Synonyms:
M-OR-1 MOR-1 MUOR1 Mu opiate receptor OPRM1 hMOP | mu-type opioid receptor isoform MOR-1
Type:
G Protein-Coupled Receptor (GPCR)
Mol. Mass.:
44789.51
Organism:
Homo sapiens (Human)
Description:
P35372
Residue:
400
  
Inhibitor
Name:
BDBM50311480
Synonyms:
CHEMBL1079941 | N-methyl-2-(1-(1-((4-methylnaphthalen-1-yl)methyl)piperidin-4-yl)-2-oxo-1,2-dihydroquinazolin-3(4H)-yl)acetamide
Type:
Small organic molecule
Emp. Form.:
C28H32N4O2
Mol. Mass.:
456.5793
SMILES:
CNC(=O)CN1Cc2ccccc2N(C2CCN(Cc3ccc(C)c4ccccc34)CC2)C1=O
: