Target
Nociceptin receptor
Ligand
BDBM50311480
Substrate
Meas. Tech.
ChEMBL_622957 (CHEMBL1112209)
Ki
22±n/a nM
Citation
 Palin, RClark, JKEvans, LFeilden, HFletcher, DHamilton, NMHoughton, AKJones, PSMcArthur, DMontgomery, BRatcliffe, PDSmith, ARSutherland, AWeston, MAWishart, G Rapid access towards follow-up NOP receptor agonists using a knowledge based approach. Bioorg Med Chem Lett 19:6441-6 (2009)  
Target
Name:
Nociceptin receptor
Synonyms:
KOR-3 Mu-type opioid receptor (Mu) Nociceptin Receptor (ORL1 Receptor) Nociceptin receptor (ORL-1) Nociceptin/Orphanin FQ, NOP receptor OPIATE ORL-1 OPRL1 protein ORL1 Opioid receptor like-1 Orphanin FQ receptor (ORL1) | P41146
Type:
G Protein-Coupled Receptor (GPCR)
Mol. Mass.:
40702.87
Organism:
Homo sapiens (Human)
Description:
P41146
Residue:
370
  
Inhibitor
Name:
BDBM50311480
Synonyms:
CHEMBL1079941 | N-methyl-2-(1-(1-((4-methylnaphthalen-1-yl)methyl)piperidin-4-yl)-2-oxo-1,2-dihydroquinazolin-3(4H)-yl)acetamide
Type:
Small organic molecule
Emp. Form.:
C28H32N4O2
Mol. Mass.:
456.5793
SMILES:
CNC(=O)CN1Cc2ccccc2N(C2CCN(Cc3ccc(C)c4ccccc34)CC2)C1=O
: