Target
Histamine H3 receptor
Ligand
BDBM50074087
Substrate
Meas. Tech.
ChEMBL_619277 (CHEMBL1100657)
Ki
20±n/a nM
Citation
 Łazewska, DWiecek, MLigneau, XKottke, TWeizel, LSeifert, RSchunack, WStark, HKiec-Kononowicz, K Histamine H3 and H4 receptor affinity of branched 3-(1H-imidazol-4-yl)propyl N-alkylcarbamates. Bioorg Med Chem Lett 19:6682-5 (2009)  
Target
Name:
Histamine H3 receptor
Synonyms:
HH3R Hrh3
Type:
G Protein-Coupled Receptor (GPCR)
Mol. Mass.:
48607.98
Organism:
Rattus norvegicus (rat)
Description:
Residue:
445
  
Inhibitor
Name:
BDBM50074087
Synonyms:
CHEMBL1076266 sec-Butyl-carbamic acid 3-(1H-imidazol-4-yl)-propyl ester; compound with (E)-but-2-enedioic acid
Type:
Small organic molecule
Emp. Form.:
C11H19N3O2
Mol. Mass.:
225.2875
SMILES:
CCC(C)NC(=O)OCCCc1cnc[nH]1
: