Target
Histamine H3 receptor
Ligand
BDBM50074087
Substrate
Meas. Tech.
ChEMBL_619278 (CHEMBL1100658)
Ki
49±n/a nM
Citation
 Łazewska, DWiecek, MLigneau, XKottke, TWeizel, LSeifert, RSchunack, WStark, HKiec-Kononowicz, K Histamine H3 and H4 receptor affinity of branched 3-(1H-imidazol-4-yl)propyl N-alkylcarbamates. Bioorg Med Chem Lett 19:6682-5 (2009)  
Target
Name:
Histamine H3 receptor
Synonyms:
G-protein coupled receptor 97 HH3R HRH3 Histamine H3 receptor (H3) Histamine receptor (H3 and H4)
Type:
G Protein-Coupled Receptor (GPCR)
Mol. Mass.:
48691.47
Organism:
Homo sapiens (Human)
Description:
Binding assays were using CHO cells stably expressing hH3R receptors.
Residue:
445
  
Inhibitor
Name:
BDBM50074087
Synonyms:
CHEMBL1076266 sec-Butyl-carbamic acid 3-(1H-imidazol-4-yl)-propyl ester; compound with (E)-but-2-enedioic acid
Type:
Small organic molecule
Emp. Form.:
C11H19N3O2
Mol. Mass.:
225.2875
SMILES:
CCC(C)NC(=O)OCCCc1cnc[nH]1
: