Target
Serine/threonine-protein kinase B-raf
Ligand
BDBM50312057
Substrate
Meas. Tech.
ChEMBL_620609 (CHEMBL1114817)
IC50
24±n/a nM
Citation
 Berger, DMTorres, NDutia, MPowell, DCiszewski, GGopalsamy, ALevin, JIKim, KHXu, WWilhelm, JHu, YCollins, KFeldberg, LKim, SFrommer, EWojciechowicz, DMallon, R Non-hinge-binding pyrazolo[1,5-a]pyrimidines as potent B-Raf kinase inhibitors. Bioorg Med Chem Lett 19:6519-23 (2009)  
Target
Name:
Serine/threonine-protein kinase B-raf
Synonyms:
B-RAF B-Raf proto-oncogene serine/threonine-protein kinase BRAF1 RAFB1 v-Raf murine sarcoma viral oncogene homolog B1
Type:
Serine/threonine-protein kinase
Mol. Mass.:
84446.00
Organism:
Homo sapiens (Human)
Description:
P15056
Residue:
766
  
Inhibitor
Name:
BDBM50312057
Synonyms:
CHEMBL1087397 N-[3-(3-{4-[(dimethylamino)methyl]phenyl}pyrazolo[1,5-a]pyrimidin-7-yl)phenyl]-3-(trifluoromethyl)benzamide
Type:
Small organic molecule
Emp. Form.:
C29H24F3N5O
Mol. Mass.:
515.529
SMILES:
CN(C)Cc1ccc(cc1)-c1cnn2c(ccnc12)-c1cccc(NC(=O)c2cccc(c2)C(F)(F)F)c1
: