Target
Metabotropic glutamate receptor 5
Ligand
BDBM50312144
Substrate
Meas. Tech.
ChEMBL_620938 (CHEMBL1117583)
IC50
1050±n/a nM
Citation
 Zhou, YRodriguez, ALWilliams, RWeaver, CDConn, PJLindsley, CW Synthesis and SAR of novel, non-MPEP chemotype mGluR5 NAMs identified by functional HTS. Bioorg Med Chem Lett 19:6502-6 (2009)  
Target
Name:
Metabotropic glutamate receptor 5
Synonyms:
GRM5_RAT Grm5 Mglur5 metabotropic glutamate 5/1-C metabotropic glutamate 5a
Type:
Enzyme
Mol. Mass.:
131900.14
Organism:
Rattus norvegicus (Rat)
Description:
P31424
Residue:
1203
  
Inhibitor
Name:
BDBM50312144
Synonyms:
3-(1,3-dioxoisoindolin-2-yl)-N-(2-fluorophenyl)benzamide | CHEMBL1080875
Type:
Small organic molecule
Emp. Form.:
C21H13FN2O3
Mol. Mass.:
360.3379
SMILES:
Fc1ccccc1NC(=O)c1cccc(c1)N1C(=O)c2ccccc2C1=O
: