Target
Mast/stem cell growth factor receptor Kit
Ligand
BDBM50207473
Substrate
Meas. Tech.
ChEMBL_622359 (CHEMBL1114167)
IC50
13±n/a nM
Citation
 Kansal, NSilakari, ORavikumar, M Three dimensional pharmacophore modelling for c-Kit receptor tyrosine kinase inhibitors. Eur J Med Chem 45:393-404 (2010)  
Target
Name:
Mast/stem cell growth factor receptor Kit
Synonyms:
CD117 antigen KIT Mast/stem cell growth factor receptor Kit (cKIT) Proto-oncogene tyrosine-protein kinase Kit Stem cell growth factor receptor Tyrosine-protein kinase Kit c-kit v-kit Hardy-Zuckerman 4 feline sarcoma viral oncogene homolog
Type:
Protein
Mol. Mass.:
109869.37
Organism:
Homo sapiens (Human)
Description:
P10721
Residue:
976
  
Inhibitor
Name:
BDBM50207473
Synonyms:
1-(4-(3-amino-1H-indazol-4-yl)phenyl)-3-(3-chlorophenyl)urea N-[4-(3-amino-1H-indazol-4-yl)phenyl]-N'-(3-chlorophenyl)-urea
Type:
Small organic molecule
Emp. Form.:
C20H16ClN5O
Mol. Mass.:
377.827
SMILES:
Nc1n[nH]c2cccc(-c3ccc(NC(=O)Nc4cccc(Cl)c4)cc3)c12
: