Target
Nitric oxide synthase, brain
Ligand
BDBM50312521
Substrate
Meas. Tech.
ChEMBL_620297 (CHEMBL1105082)
IC50
19000±n/a nM
Citation
 Xue, FFang, JLewis, WWMartásek, PRoman, LJSilverman, RB Potent and selective neuronal nitric oxide synthase inhibitors with improved cellular permeability. Bioorg Med Chem Lett 20:554-7 (2010)  
Target
Name:
Nitric oxide synthase, brain
Synonyms:
Constitutive NOS NC-NOS NOS type I nNOS NOS1_HUMAN Neuronal nitric oxide synthase Nitric oxide synthase, neuronal (nNOS) bNOS | nNOS
Type:
Homodimer
Mol. Mass.:
160985.98
Organism:
Homo sapiens (Human)
Description:
P29475
Residue:
1434
  
Inhibitor
Name:
BDBM50312521
Synonyms:
6-(((3S,4S)/(3R,4R)-4-(2-(2,2-Difluoro-2-(3-fluorophenyl)ethylamino)ethoxy)pyrrolidin-3-yl)methyl)-4-methylpyridin-2-amine | CHEMBL1086859
Type:
Small organic molecule
Emp. Form.:
C21H27F3N4O
Mol. Mass.:
408.4605
SMILES:
Cc1cc(N)nc(CC2CNCC2OCCNCC(F)(F)c2cccc(F)c2)c1
: