Target
Nitric oxide synthase, endothelial
Ligand
BDBM50312522
Substrate
Meas. Tech.
ChEMBL_619388 (CHEMBL1104146)
Ki
21000±n/a nM
Citation
 Xue, FFang, JLewis, WWMartásek, PRoman, LJSilverman, RB Potent and selective neuronal nitric oxide synthase inhibitors with improved cellular permeability. Bioorg Med Chem Lett 20:554-7 (2010)  
Target
Name:
Nitric oxide synthase, endothelial
Synonyms:
Constitutive NOS Endothelial nitric oxide synthase NOS type III NOS3_BOVIN Nitric-oxide synthase, endothelial | cNOS
Type:
Enzyme
Mol. Mass.:
133292.26
Organism:
Bos taurus (bovine)
Description:
Recombinant eNOS overexpressed in E. coli was used in enzyme assays.
Residue:
1205
  
Inhibitor
Name:
BDBM50312522
Synonyms:
6-(((3S,4S)/(3R,4R)-4-(2-(2-(3-Fluorophenoxy)ethylamino)ethoxy)pyrrolidin-3-yl)methyl)-4-methylpyridin-2-amine | CHEMBL1087746
Type:
Small organic molecule
Emp. Form.:
C21H29FN4O2
Mol. Mass.:
388.479
SMILES:
Cc1cc(N)nc(CC2CNCC2OCCNCCOc2cccc(F)c2)c1
: