Target
Nitric oxide synthase, inducible
Ligand
BDBM50312521
Substrate
Meas. Tech.
ChEMBL_619389 (CHEMBL1104147)
Ki
52000±n/a nM
Citation
 Xue, FFang, JLewis, WWMartásek, PRoman, LJSilverman, RB Potent and selective neuronal nitric oxide synthase inhibitors with improved cellular permeability. Bioorg Med Chem Lett 20:554-7 (2010)  
Target
Name:
Nitric oxide synthase, inducible
Synonyms:
Inducible NO synthase Inducible nitric oxide synthase (iNOS) MAC-NOS NOS type II Nitric Oxide Synthase, inducible Nos2
Type:
Enzyme
Mol. Mass.:
130595.79
Organism:
Mus musculus (mouse)
Description:
Recombinant enzyme overexpressed in E. coli.
Residue:
1144
  
Inhibitor
Name:
BDBM50312521
Synonyms:
6-(((3S,4S)/(3R,4R)-4-(2-(2,2-Difluoro-2-(3-fluorophenyl)ethylamino)ethoxy)pyrrolidin-3-yl)methyl)-4-methylpyridin-2-amine | CHEMBL1086859
Type:
Small organic molecule
Emp. Form.:
C21H27F3N4O
Mol. Mass.:
408.4605
SMILES:
Cc1cc(N)nc(CC2CNCC2OCCNCC(F)(F)c2cccc(F)c2)c1
: